当前位置:首页 > 服务端 > Maven常见异常《一》

Maven常见异常《一》

异常1:

[ERROR] Failed to execute goal on project biz_zhuhai: Could not resolve dependencies for project biz_zhuhai:biz_zhuhai:jar:0.0.1-SNAPSHOT: Failed to collect dependencies for [com.maywide.ibh:lib345:pom:1.0 (compile)]: Failed to read artifact descriptor for com.maywide.ibh:lib345:pom:1.0: Could not transfer artifact com.maywide.ibh:lib345:pom:1.0 from/to releases (http://localhost:9888/nexus-2.0.3/content/repositories/releases): Connection to http://localhost:9888 refused: Connection refused: connect -> [Help 1]

解决方法:

这是配置的url有错误或者是私服没有配好,导致构件下载时出错。如果没有jar包需要在私服里下载,可以不配置私服的,也就是可以把setting.xml的profiles里的东西全部删除的。

异常2

[ERROR] Failed to execute goal org.apache.maven.plugins:maven-surefire-plugin:2.10:test (default-test) on project web_nanchang: There are test failures.

[ERROR]

[ERROR] Please refer to E:\maven\web_nanchang\target\surefire-reports for the individual test results.

解决方法:

这是因为测试代码时遇到错误,它会停止编译。只需要在pom.xml的<project>里添加以下配置,使得测试出错不影响项目的编译。

<build>
    <plugins>
        <plugin>
            <groupId>org.apache.maven.plugins</groupId>
            <artifactId>maven-surefire-plugin</artifactId>
            <configuration>
                <testFailureIgnore>true</testFailureIgnore>
            </configuration>
        </plugin>
    </plugins>
</build>

异常3:

[ERROR] Failed to execute goal org.codehaus.cargo:cargo-maven2-plugin:1.0.6:start (start-Container) on project myproject: Execution start-container of goal org.codehaus.cargo:cargo-maven2-plugin:1.0.6:start failed: Error while expanding C:\DOCUME~1\ADMINI~1\LOCALS~1\Temp\cargo\installs\apache-tomcat-6.0.29.zip
[ERROR] Java.io.IOException: Negative seek offset
[ERROR] -> [Help 1]
[ERROR]
[ERROR] To see the full stack trace of the errors, re-run Maven with the -e swit
ch.
[ERROR] Re-run Maven using the -X switch to enable full debug logging.
[ERROR]
[ERROR] For more information about the errors and possible solutions, please rea
d the following articles:
[ERROR] [Help 1] http://cwiki.apache.org/confluence/display/MAVEN/PluginExecutio
nException

解决方法:

自己下载“apache-tomcat-6.0.29.zip”,将下载好的文件拷贝到指定文件夹“C:\Documents and Settings\Administrator\Local Settings\Temp\cargo\installs”下。

异常4

[ERROR] Failed to execute goal org.apache.maven.plugins:maven-war-plugin:2.1.1:war (default-war) on project web_nanchang: Error assembling WAR: webxml attribute is required (or pre-existing WEB-INF/web.xml if executing in update mode) -> [Help 1]

[ERROR]

[ERROR] To see the full stack trace of the errors, re-run Maven with the -e switch.

[ERROR] Re-run Maven using the -X switch to enable full debug logging.

[ERROR]

[ERROR] For more information about the errors and possible solutions, please read the following articles:

解决方法:

maven的web项目默认的webroot是在src\main\webapp。如果在此目录下找不到web.xml就抛出以上的异常。解决方法在pom.xml加入以下的配置。红色字体改成你网站的根目录。

<build>
    <finalName>simple-webapp</finalName>
    <plugins>
        <plugin>
            <groupId>org.apache.maven.plugins</groupId>
            <artifactId>maven-war-plugin</artifactId>
            <version>2.1.1</version>
            <configuration>
                <webResources>
                    <resource>
                        <!-- this is relative to the pom.xml directory -->
                        <directory>WebContent</directory>
                    </resource>
                </webResources>
            </configuration>
        </plugin>
    </plugins>
</build>

作者:牧野圣君
来源链接:https://www.cnblogs.com/huangzhe623/p/6877692.html

版权声明:
1、Java侠(https://www.javaxia.com)以学习交流为目的,由作者投稿、网友推荐和小编整理收藏优秀的IT技术及相关内容,包括但不限于文字、图片、音频、视频、软件、程序等,其均来自互联网,本站不享有版权,版权归原作者所有。

2、本站提供的内容仅用于个人学习、研究或欣赏,以及其他非商业性或非盈利性用途,但同时应遵守著作权法及其他相关法律的规定,不得侵犯相关权利人及本网站的合法权利。
3、本网站内容原作者如不愿意在本网站刊登内容,请及时通知本站(javaclubcn@163.com),我们将第一时间核实后及时予以删除。





本文链接:https://www.javaxia.com/server/125318.html

分享给朋友:

“Maven常见异常《一》” 的相关文章

Java日志框架那些事儿2022年05月19日 20:04:37
多线程编程(1)2022年05月20日 21:26:51
投票统计,遍历数据2022年05月21日 11:41:42
学习go语言国内最全资料链接2022年05月23日 21:27:32
Tomcat服务器目录结构2022年05月28日 22:49:58
从0到1入门Serverless2022年05月28日 23:26:27
OpenHarmony的多内核2022年05月30日 23:18:14